BDBM50140711 5'-(3,4-dichlorophenyl)-3'-phenyl-(3'R,3a'R,6a'S)-spiro[2,3-dihydro-1H-indene-2,1'-perhydropyrrolo[3,4-c]pyrrole]-4',6'-dione::CHEMBL281459::CHEMBL433225
SMILES Oc1c2C(NC3(Cc4ccccc4C3)c2c(O)n1-c1ccc(Cl)c(Cl)c1)c1ccccc1
InChI Key InChIKey=JGKZMSBCVHYLBA-UHFFFAOYSA-N
Data  6 IC50
  Tab Delimited (TSV)   2D SDfile   Computed 3D by Vconf -m prep SDfile
Find this compound or compounds like it in BindingDB:
Activity Spreadsheet -- Enzyme Inhibition Constant Data from BindingDB
Found 2 hits for monomerid = 50140711
TargetPhenylalanine--tRNA ligase, mitochondrial(Homo sapiens (Human))
Cubist Pharmaceuticals
Curated by ChEMBL
LigandPNGBDBM50140711(5'-(3,4-dichlorophenyl)-3'-phenyl-(3'R,3a'R,6a'S)-...)
Affinity DataIC50: >1.00E+5nM. Assay description: Inhibitory activity against human phenylalanyl-tRNA synthetase was determined
In DepthDetails ArticlePubMed
TargetPhenylalanine--tRNA ligase, mitochondrial(Homo sapiens (Human))
Cubist Pharmaceuticals
Curated by ChEMBL
LigandPNGBDBM50140711(5'-(3,4-dichlorophenyl)-3'-phenyl-(3'R,3a'R,6a'S)-...)
Affinity DataIC50: >1.00E+5nM. Assay description: Inhibitory activity against phenylalanyl-tRNA synthetase from Enterococcus faecalis
In DepthDetails ArticlePubMed